Target
Platelet-activating factor receptor
Ligand
BDBM50006093
Substrate
Meas. Tech.
ChEBML_221704
IC50
1790±n/a nM
Citation
 Wissner, ACarroll, MLGreen, KEKerwar, SSPickett, WCSchaub, RETorley, LWWrenn, SKohler, CA Analogues of platelet activating factor. 6. Mono- and bis-aryl phosphate antagonists of platelet activating factor. J Med Chem 35:1650-62 (1992)  
Target
Name:
Platelet-activating factor receptor
Synonyms:
PAF-R PTAFR_CAVPO Platelet-activating factor receptor
Type:
Protein
Mol. Mass.:
39005.63
Organism:
Cavia porcellus
Description:
Residue:
342
  
Inhibitor
Name:
BDBM50006093
Synonyms:
3-(3-{[3-(3-Hexadecyloxy-2-methyl-phenoxy)-2-methoxy-propoxy]-hydroxy-phosphoryloxy}-benzyl)-thiazol-3-ium | CHEMBL294983
Type:
Small organic molecule
Emp. Form.:
C37H56NO7PS
Mol. Mass.:
689.882
SMILES:
CCCCCCCCCCCCCCCCOc1cccc(OCC(COP([O-])(=O)Oc2cccc(C[n+]3ccsc3)c2)OC)c1C
: