Target
Platelet-activating factor receptor
Ligand
BDBM50006034
Substrate
Meas. Tech.
ChEBML_221704
IC50
14400±n/a nM
Citation
 Wissner, ACarroll, MLGreen, KEKerwar, SSPickett, WCSchaub, RETorley, LWWrenn, SKohler, CA Analogues of platelet activating factor. 6. Mono- and bis-aryl phosphate antagonists of platelet activating factor. J Med Chem 35:1650-62 (1992)  
Target
Name:
Platelet-activating factor receptor
Synonyms:
PAF-R PTAFR_CAVPO Platelet-activating factor receptor
Type:
Protein
Mol. Mass.:
39005.63
Organism:
Cavia porcellus
Description:
Residue:
342
  
Inhibitor
Name:
BDBM50006034
Synonyms:
1-{3-[Hydroxy-(2-methoxy-3-tetradecyloxy-phenoxy)-phosphoryloxy]-benzyl}-3-methyl-3H-imidazol-1-ium | CHEMBL46762
Type:
Small organic molecule
Emp. Form.:
C32H47N2O6P
Mol. Mass.:
586.6991
SMILES:
CCCCCCCCCCCCCCOc1cccc(OP([O-])(=O)Oc2cccc(C[n+]3ccn(C)c3)c2)c1OC
: