Target
D(2) dopamine receptor
Ligand
BDBM50455994
Substrate
Meas. Tech.
ChEBML_62562
Ki
63±n/a nM
Citation
 Chidester, CGLin, CHLahti, RAHaadsma-Svensson, SRSmith, MW Comparison of 5-HT1A and dopamine D2 pharmacophores. X-ray structures and affinities of conformationally constrained ligands. J Med Chem 36:1301-15 (1993)  
Target
Name:
D(2) dopamine receptor
Synonyms:
DOPAMINE D2 DOPAMINE D2 Short Dopamine D2 receptor Drd2
Type:
G Protein-Coupled Receptor (GPCR)
Mol. Mass.:
50931.60
Organism:
Rattus norvegicus (rat)
Description:
P61169
Residue:
444
  
Inhibitor
Name:
BDBM50455994
Synonyms:
CHEMBL2051769
Type:
Small organic molecule
Emp. Form.:
C16H23NO
Mol. Mass.:
245.3599
SMILES:
[H][C@]12CCc3c(OC)cccc3[C@]1([H])CCN2CCC
: