Target
D(2) dopamine receptor
Ligand
BDBM50047145
Substrate
Meas. Tech.
ChEBML_62562
Ki
39±n/a nM
Citation
 Chidester, CGLin, CHLahti, RAHaadsma-Svensson, SRSmith, MW Comparison of 5-HT1A and dopamine D2 pharmacophores. X-ray structures and affinities of conformationally constrained ligands. J Med Chem 36:1301-15 (1993)  
Target
Name:
D(2) dopamine receptor
Synonyms:
DOPAMINE D2 DOPAMINE D2 Short Dopamine D2 receptor Drd2
Type:
G Protein-Coupled Receptor (GPCR)
Mol. Mass.:
50931.60
Organism:
Rattus norvegicus (rat)
Description:
P61169
Residue:
444
  
Inhibitor
Name:
BDBM50047145
Synonyms:
(Recemic)5-Dipropylamino-5,6-dihydro-1H,4H-imidazo[4,5,1-ij]quinoline-2-thione | CHEMBL281248
Type:
Small organic molecule
Emp. Form.:
C16H23N3S
Mol. Mass.:
289.439
SMILES:
CCCN(CCC)[C@@H]1Cc2cccc3[nH]c(=S)n(C1)c23
: