Target
D(2) dopamine receptor
Ligand
BDBM50047147
Substrate
Meas. Tech.
ChEBML_59890
Ki
3.5±n/a nM
Citation
 Chidester, CGLin, CHLahti, RAHaadsma-Svensson, SRSmith, MW Comparison of 5-HT1A and dopamine D2 pharmacophores. X-ray structures and affinities of conformationally constrained ligands. J Med Chem 36:1301-15 (1993)  
Target
Name:
D(2) dopamine receptor
Synonyms:
D(2) dopamine receptor DOPAMINE D2 Long DRD2 Dopamine D2 receptor Dopamine D2 receptor (D2R) Dopamine2-like | d2
Type:
Cell-surface receptors
Mol. Mass.:
50647.10
Organism:
Homo sapiens (Human)
Description:
P14416
Residue:
443
  
Inhibitor
Name:
BDBM50047147
Synonyms:
(Recemic)6-Dipropylamino-6,7-dihydro-5H-pyrido[3,2,1-ij]quinolin-3-one | CHEMBL24978
Type:
Small organic molecule
Emp. Form.:
C18H24N2O
Mol. Mass.:
284.396
SMILES:
CCCN(CCC)[C@@H]1Cc2cccc3ccc(=O)n(C1)c23
: