Target
Substance-K receptor
Ligand
BDBM50045032
Substrate
Meas. Tech.
ChEMBL_141787 (CHEMBL745325)
IC50
489±n/a nM
Citation
 Kucharczyk, NThurieau, CPaladino, JMorris, ADBonnet, JCanet, EKrause, JERegoli, DCouture, RFauchère, JL Tetrapeptide tachykinin antagonists: synthesis and modulation of the physicochemical and pharmacological properties of a new series of partially cyclic analogs. J Med Chem 36:1654-61 (1993)  
Target
Name:
Substance-K receptor
Synonyms:
NK-2 receptor NK2R_RAT Neurokinin A receptor SKR Tac2r Tacr2
Type:
Enzyme Catalytic Domain
Mol. Mass.:
43868.63
Organism:
Rattus norvegicus (Rat)
Description:
Neurokinin NK2 TACR2 Murine::P16610
Residue:
390
  
Inhibitor
Name:
BDBM50045032
Synonyms:
CHEMBL3144353 | N-Benzyl-2-[2-[2-(3,6-dioxo-2,5-diaza-tricyclo[6.2.2.0*2,7*]dodec-4-yl)-acetylamino]-3-(1-methyl-1H-indol-3-yl)-propionylamino]-N-methyl-3-phenyl-propionamide
Type:
Small organic molecule
Emp. Form.:
C41H46N6O5
Mol. Mass.:
702.8411
SMILES:
CN(Cc1ccccc1)C(=O)[C@H](Cc1ccccc1)NC(=O)[C@@H](Cc1cn(C)c2ccccc12)NC(=O)C[C@@H]1NC(=O)[C@@H]2C3CCC(CC3)N2C1=O
: