Target
Substance-K receptor
Ligand
BDBM50045037
Substrate
Meas. Tech.
ChEMBL_141784 (CHEMBL745322)
IC50
65±n/a nM
Citation
 Kucharczyk, NThurieau, CPaladino, JMorris, ADBonnet, JCanet, EKrause, JERegoli, DCouture, RFauchère, JL Tetrapeptide tachykinin antagonists: synthesis and modulation of the physicochemical and pharmacological properties of a new series of partially cyclic analogs. J Med Chem 36:1654-61 (1993)  
Target
Name:
Substance-K receptor
Synonyms:
NK-2 receptor NK2R NKNAR Neurokinin A receptor Neurokinin-2 (NK-2) SKR TACR2 Tachykinin receptor 2 (NK2) | hnk-3
Type:
Protein
Mol. Mass.:
44455.78
Organism:
Homo sapiens (Human)
Description:
P21452
Residue:
398
  
Inhibitor
Name:
BDBM50045037
Synonyms:
CHEMBL3144352 | N-Benzyl-2-[2-[2-(3,6-dioxo-2,5-diaza-tricyclo[6.2.2.0*2,7*]dodec-4-yl)-acetylamino]-3-(1H-indol-3-yl)-propionylamino]-N-methyl-3-phenyl-propionamide
Type:
Small organic molecule
Emp. Form.:
C40H44N6O5
Mol. Mass.:
688.8146
SMILES:
CN(Cc1ccccc1)C(=O)[C@H](Cc1ccccc1)NC(=O)[C@@H](Cc1c[nH]c2ccccc12)NC(=O)C[C@@H]1NC(=O)[C@@H]2C3CCC(CC3)N2C1=O
: