Target
Angiotensin-converting enzyme
Ligand
BDBM50044233
Substrate
Meas. Tech.
ChEBML_36748
IC50
260000±n/a nM
Citation
 Patchett, AA Excursions in drug discovery. J Med Chem 36:2051-8 (1993)  
Target
Name:
Angiotensin-converting enzyme
Synonyms:
ACE Angiotensin converting enzyme (ACE) Angiotensin-converting enzyme, soluble form CD_antigen=CD143 DCP1 Kininase II
Type:
Enzyme
Mol. Mass.:
149709.01
Organism:
Homo sapiens (Human)
Description:
Residue:
1306
  
Inhibitor
Name:
BDBM50044233
Synonyms:
1-(4-Carboxy-pentanoyl)-pyrrolidine-2-carboxylic acid | CHEMBL293213
Type:
Small organic molecule
Emp. Form.:
C11H17NO5
Mol. Mass.:
243.2564
SMILES:
CC(CCC(=O)N1CCCC1C(O)=O)C(O)=O
: