Target
5-hydroxytryptamine receptor 1A
Ligand
BDBM50368641
Substrate
Meas. Tech.
ChEBML_558
Ki
0.200000±n/a nM
Citation
 Romero, AGLeiby, JAMcCall, RBPiercey, MFSmith, MWHan, F Novel 2-substituted tetrahydro-3H-benz[e]indolamines: highly potent and selective agonists acting at the 5-HT1A receptor as possible anxiolytics and antidepressants. J Med Chem 36:2066-74 (1993)  
Target
Name:
5-hydroxytryptamine receptor 1A
Synonyms:
5-HT-1A 5-hydroxytryptamine receptor 1A (5-HT-1A) ADRB2RL1 Dopamine D2 receptor and serotonin 1a receptor HTR1A | Serotonin receptor 1A
Type:
Mol. Mass.:
46122.49
Organism:
Homo sapiens (Human)
Description:
Residue:
422
  
Inhibitor
Name:
BDBM50368641
Synonyms:
CHEMBL1744088
Type:
Small organic molecule
Emp. Form.:
C27H36N4O2
Mol. Mass.:
448.6003
SMILES:
CCCN(CCCCN1C(=O)CC(C)(C)CC1=O)[C@@H]1CCc2ccc3[nH]c(cc3c2C1)C#N
: