Target
Gag-Pol polyprotein [489-587]
Ligand
BDBM13936
Substrate
Meas. Tech.
ChEBML_159976
Ki
780±n/a nM
Citation
 Caflisch, AMiranker, AKarplus, M Multiple copy simultaneous search and construction of ligands in binding sites: application to inhibitors of HIV-1 aspartic proteinase. J Med Chem 36:2142-67 (1993)  
Target
Name:
Gag-Pol polyprotein [489-587]
Synonyms:
Human immunodeficiency virus type 1 protease Pol polyprotein | gag-pol
Type:
Enzyme Subunit
Mol. Mass.:
10781.16
Organism:
Human immunodeficiency virus type 1
Description:
P04585[489-587]
Residue:
99
  
Inhibitor
Name:
BDBM13936
Synonyms:
(2S)-N-[(1S)-4-carbamimidamido-1-carbamoylbutyl]-2-[(2S)-2-{[(2S)-2-[(2S,3S)-2-[(2S,3R)-2-acetamido-3-hydroxybutanamido]-3-methylpentanamido]hexyl]amino}hexanamido]pentanediamide Ace-T-I-Nle-r-Nle-Q-R N-1465 | Peptide Inhibitor p2/NC
Type:
8-mer
Emp. Form.:
C35H67N11O8
Mol. Mass.:
769.9754
SMILES:
CCCC[C@@H](CN[C@@H](CCCC)C(=O)N[C@@H](CCC(N)=O)C(=O)N[C@@H](CCCNC(N)=N)C(N)=O)NC(=O)[C@@H](NC(=O)[C@@H](NC(C)=O)[C@@H](C)O)[C@@H](C)CC
: