Target
Adenosine receptor A2a/A2b
Ligand
BDBM50044435
Substrate
Meas. Tech.
ChEBML_30869
Ki
>100000±n/a nM
Citation
 Suzuki, FShimada, JShiozaki, SIchikawa, SIshii, ANakamura, JNonaka, HKobayashi, HFuse, E Adenosine A1 antagonists. 3. Structure-activity relationships on amelioration against scopolamine- or N6-((R)-phenylisopropyl)adenosine-induced cognitive disturbance. J Med Chem 36:2508-18 (1993)  
Target
Name:
Adenosine receptor A2a/A2b
Synonyms:
Adenosine A2 receptor
Type:
Mol. Mass.:
Description:
ASSAY_ID of ChEMBL is 30560
Components:
This complex has 2 components.
Component 1
Name:
Adenosine receptor A2b
Synonyms:
AA2BR_RAT Adora2b
Type:
PROTEIN
Mol. Mass.:
36378.84
Organism:
Rattus norvegicus
Description:
ChEMBL_32934
Residue:
332
  
Component 2
Name:
Adenosine receptor A2a
Synonyms:
AA2AR_RAT Adenosine A2 receptor Adenosine Receptors A2a (A2a) Adenosine receptors A2a Rat striatal adenosine A2a receptor
Type:
G Protein-Coupled Receptor (GPCR)
Mol. Mass.:
45015.65
Organism:
Rattus norvegicus (rat)
Description:
Rat A2A receptors expressed in CHO cells.
Residue:
410
  
Inhibitor
Name:
BDBM50044435
Synonyms:
3-[2-(4-Amino-phenyl)-ethyl]-8-(3-oxo-cyclopentyl)-1-propyl-3,7-dihydro-purine-2,6-dione | CHEMBL83822
Type:
Small organic molecule
Emp. Form.:
C21H25N5O3
Mol. Mass.:
395.4549
SMILES:
CCCn1c(=O)n(CCc2ccc(N)cc2)c2nc([nH]c2c1=O)C1CCC(=O)C1
: