Target
Adenosine receptor A1
Ligand
BDBM50003021
Substrate
Meas. Tech.
ChEBML_29637
Ki
0.560000±n/a nM
Citation
 Suzuki, FShimada, JShiozaki, SIchikawa, SIshii, ANakamura, JNonaka, HKobayashi, HFuse, E Adenosine A1 antagonists. 3. Structure-activity relationships on amelioration against scopolamine- or N6-((R)-phenylisopropyl)adenosine-induced cognitive disturbance. J Med Chem 36:2508-18 (1993)  
Target
Name:
Adenosine receptor A1
Synonyms:
AA1R_RAT ADENOSINE A1 high Adenosine A1 receptor (A1) Adenosine receptors A1 | Adora1
Type:
Protein
Mol. Mass.:
36704.13
Organism:
Rattus norvegicus (rat)
Description:
Residue:
326
  
Inhibitor
Name:
BDBM50003021
Synonyms:
7-Ethyl-2-(hexahydro-2,5-methano-pentalen-3a-yl)-4-propyl-1,4,6,7-tetrahydro-1,3,4,5a,8-pentaaza-as-indacen-5-one | CHEMBL116486
Type:
Small organic molecule
Emp. Form.:
C21H29N5O
Mol. Mass.:
367.4879
SMILES:
CCCn1c2nc(nc2c2N[C@H](CC)Cn2c1=O)C12CC3CC1CC(C2)C3
: