Target
Endothelin receptor type B/1 receptor
Ligand
BDBM50001218
Substrate
Meas. Tech.
ChEBML_64206
IC50
4400±n/a nM
Citation
 Doherty, AMCody, WLDePue, PLHe, JXWaite, LALeonard, DMLeitz, NLDudley, DTRapundalo, STHingorani, GP Structure-activity relationships of C-terminal endothelin hexapeptide antagonists. J Med Chem 36:2585-94 (1993)  
Target
Name:
Endothelin receptor type B/1 receptor
Synonyms:
Endothelin receptor
Type:
Mol. Mass.:
Description:
ASSAY_ID of ChEMBL is 64206
Components:
This complex has 2 components.
Component 1
Name:
Endothelin receptor type B
Synonyms:
EDNRB_RAT ET-B Endothelin receptor | Endothelin receptor non-selective type
Type:
Enzyme Catalytic Domain
Mol. Mass.:
49483.43
Organism:
RAT
Description:
ENDOTHELIN B EDNRB RAT::P21451
Residue:
442
  
Component 2
Name:
Endothelin-1 receptor
Synonyms:
EDNRA_RAT Ednra Endothelin-1 receptor
Type:
Enzyme Catalytic Domain
Mol. Mass.:
48256.91
Organism:
RAT
Description:
ENDOTHELIN A EDNRA RAT::P26684
Residue:
426
  
Inhibitor
Name:
BDBM50001218
Synonyms:
3-[2-(2-Acetylamino-3-biphenyl-4-yl-propionylamino)-4-methyl-pentanoylamino]-N-(1-{1-[1-carboxy-2-(1H-indol-3-yl)-ethylcarbamoyl]-2-methyl-butylcarbamoyl}-2-methyl-butyl)-succinamic acid | CHEMBL438194
Type:
Small organic molecule
Emp. Form.:
C50H65N7O10
Mol. Mass.:
924.092
SMILES:
CC[C@H](C)[C@H](NC(=O)[C@@H](NC(=O)[C@H](CC(O)=O)NC(=O)[C@H](CC(C)C)NC(=O)[C@@H](Cc1ccc(cc1)-c1ccccc1)NC(C)=O)[C@@H](C)CC)C(=O)N[C@@H](Cc1c[nH]c2ccccc12)C(O)=O
: