Target
Endothelin-1 receptor
Ligand
BDBM50045246
Substrate
Meas. Tech.
ChEMBL_65825 (CHEMBL682959)
EC50
13±n/a nM
Citation
 Doherty, AMCody, WLDePue, PLHe, JXWaite, LALeonard, DMLeitz, NLDudley, DTRapundalo, STHingorani, GP Structure-activity relationships of C-terminal endothelin hexapeptide antagonists. J Med Chem 36:2585-94 (1993)  
Target
Name:
Endothelin-1 receptor
Synonyms:
EDNRA ET-A ETA-R Endothelin receptor type A hET-AR
Type:
Enzyme Catalytic Domain
Mol. Mass.:
48736.88
Organism:
Homo sapiens (Human)
Description:
P25101
Residue:
427
  
Inhibitor
Name:
BDBM50045246
Synonyms:
Ac-D-Dip-Orn-Asp-Ile-Ile-Trp | CHEMBL2370066
Type:
Small organic molecule
Emp. Form.:
C49H64N8O10
Mol. Mass.:
925.0801
SMILES:
CC[C@H](C)[C@H](NC(=O)[C@H](CC(O)=O)NC(=O)[C@H](CCCN)NC(=O)[C@H](NC(C)=O)C(c1ccccc1)c1ccccc1)C(=O)N[C@@H]([C@@H](C)CC)C(=O)N[C@@H](Cc1c[nH]c2ccccc12)C(O)=O
: