Target
Ribonucleoside-diphosphate reductase large subunit
Ligand
BDBM50046035
Substrate
Meas. Tech.
ChEBML_90946
IC50
>1000000±n/a nM
Citation
 Moss, NDéziel, RAdams, JAubry, NBailey, MBaillet, MBeaulieu, PDiMaio, JDuceppe, JSFerland, JM Inhibition of herpes simplex virus type 1 ribonucleotide reductase by substituted tetrapeptide derivatives. J Med Chem 36:3005-9 (1993)  
Target
Name:
Ribonucleoside-diphosphate reductase large subunit
Synonyms:
RIR1_HUMAN RRM1 Ribonucleoside-diphosphate reductase subunit M1 | Ribonucleotide reductase large subunit
Type:
PROTEIN
Mol. Mass.:
90074.67
Organism:
Homo sapiens (Human)
Description:
ChEMBL_90946
Residue:
792
  
Inhibitor
Name:
BDBM50046035
Synonyms:
3-{2-[2-(2-Ethyl-butyrylamino)-3,3-dimethyl-butyrylamino]-4-oxo-4-pyrrolidin-1-yl-butyrylamino}-N-(1-hydroxymethyl-3,3-dimethyl-butyl)-succinamic acid | CHEMBL319181
Type:
Small organic molecule
Emp. Form.:
C31H55N5O8
Mol. Mass.:
625.7971
SMILES:
CCC(CC)C(=O)N[C@H](C(=O)N[C@@H](CC(=O)N1CCCC1)C(=O)N[C@@H](CC(O)=O)C(=O)N[C@H](CO)CC(C)(C)C)C(C)(C)C
: