Target
Leukotriene B4 receptor 1
Ligand
BDBM79408
Substrate
Meas. Tech.
ChEBML_99839
Ki
700±n/a nM
Citation
 Kingsbury, WDPendrak, ILeber, JDBoehm, JCMallet, BSarau, HMFoley, JJSchmidt, DBDaines, RA Synthesis of structural analogs of leukotriene B4 and their receptor binding activity. J Med Chem 36:3308-20 (1993)  
Target
Name:
Leukotriene B4 receptor 1
Synonyms:
BLT BLTR Chemoattractant receptor-like 1 GPR16 LTB4-R 1 Leukotriene B4 R1 Leukotriene B4 receptor 1 P2Y purinoceptor 7 | P2Y7
Type:
Enzyme Catalytic Domain
Mol. Mass.:
37582.68
Organism:
Homo sapiens (Human)
Description:
Q15722
Residue:
352
  
Inhibitor
Name:
BDBM79408
Synonyms:
(5R)-6-[6-[(1E,3S,5Z)-3-hydroxyundeca-1,5-dienyl]-2-pyridinyl]hexane-1,5-diol (5R)-6-[6-[(1E,3S,5Z)-3-hydroxyundeca-1,5-dienyl]pyridin-2-yl]hexane-1,5-diol MLS000028864 U-75302 | cid_6852392
Type:
Small organic molecule
Emp. Form.:
C22H35NO3
Mol. Mass.:
361.5182
SMILES:
CCCCC\C=C/C[C@H](O)\C=C\c1cccc(C[C@H](O)CCCCO)n1
: