Target
Leukotriene B4 receptor 1
Ligand
BDBM50042149
Substrate
Meas. Tech.
ChEBML_99839
Ki
1±n/a nM
Citation
 Kingsbury, WDPendrak, ILeber, JDBoehm, JCMallet, BSarau, HMFoley, JJSchmidt, DBDaines, RA Synthesis of structural analogs of leukotriene B4 and their receptor binding activity. J Med Chem 36:3308-20 (1993)  
Target
Name:
Leukotriene B4 receptor 1
Synonyms:
BLT BLTR Chemoattractant receptor-like 1 GPR16 LTB4-R 1 Leukotriene B4 R1 Leukotriene B4 receptor 1 P2Y purinoceptor 7 | P2Y7
Type:
Enzyme Catalytic Domain
Mol. Mass.:
37582.68
Organism:
Homo sapiens (Human)
Description:
Q15722
Residue:
352
  
Inhibitor
Name:
BDBM50042149
Synonyms:
CHEMBL112520 | Lithium; 3-{1-hydroxy-2-[6-(3-hydroxy-undec-1-enyl)-pyridin-2-yl]-ethyl}-benzoate
Type:
Small organic molecule
Emp. Form.:
C25H32NO4
Mol. Mass.:
410.5264
SMILES:
CCCCCCCCC(O)\C=C\c1cccc(CC(O)c2cccc(c2)C([O-])=O)n1
: