Target
5-hydroxytryptamine receptor 1A
Ligand
BDBM50001859
Substrate
Meas. Tech.
ChEMBL_1106 (CHEMBL616290)
Ki
15±n/a nM
Citation
 Kawakubo, HTakagi, SYamaura, YKatoh, SIshimoto, YNagatani, TMochizuki, DKamata, TSasaki, Y (R)-1,2,3,4-tetrahydro[1]benzothieno[2,3-c]pyridines: novel optically active compounds with strong 5-HT1A receptor binding ability exhibiting anticonflict activity and lessening of memory impairment. J Med Chem 36:3526-32 (1994)  
Target
Name:
5-hydroxytryptamine receptor 1A
Synonyms:
5-HT-1A 5-HT1A 5-hydroxytryptamine receptor 1A (5HT1A) 5ht1a Htr1a Serotonin 1a (5-HT1a) receptor/Adrenergic receptor alpha-1 | Serotonin receptor 1A
Type:
G Protein-Coupled Receptor (GPCR)
Mol. Mass.:
46445.29
Organism:
Rattus norvegicus (rat)
Description:
Binding assays were performed using rat hippocampal membranes.
Residue:
422
  
Inhibitor
Name:
BDBM50001859
Synonyms:
(buspirone) 8-[4-(4-Pyrimidin-2-yl-piperazin-1-yl)-butyl]-8-aza-spiro[4.5]decane-7,9-dione 8-[4-(4-Pyrimidin-2-yl-piperazin-1-yl)-butyl]-8-aza-spiro[4.5]decane-7,9-dione; Hydrochloride(Buspirone) BUSPAR CHEMBL49 | US10562853, Compound Buspirone
Type:
Small organic molecule
Emp. Form.:
C21H31N5O2
Mol. Mass.:
385.5031
SMILES:
O=C1CC2(CCCC2)CC(=O)N1CCCCN1CCN(CC1)c1ncccn1
: