Target
Sodium-dependent dopamine transporter
Ligand
BDBM50042481
Substrate
Meas. Tech.
ChEBML_62143
IC50
561±n/a nM
Citation
 Srivastava, SCrippen, GM Analysis of cocaine receptor site ligand binding by three-dimensional Voronoi site modeling approach. J Med Chem 36:3572-9 (1994)  
Target
Name:
Sodium-dependent dopamine transporter
Synonyms:
DA transporter SC6A3_RAT Sodium-dependent dopamine transporter | Sodium-dependent dopamine transporter (DAT)
Type:
Multi-pass membrane protein
Mol. Mass.:
68749.45
Organism:
Rattus norvegicus (rat)
Description:
P23977
Residue:
619
  
Inhibitor
Name:
BDBM50042481
Synonyms:
CHEMBL333998 | R-Benzoic acid 2-hydroxymethyl-8-methyl-8-aza-bicyclo[3.2.1]oct-3-yl ester
Type:
Small organic molecule
Emp. Form.:
C16H21NO3
Mol. Mass.:
275.3428
SMILES:
CN1C2CCC1C(CO)[C@@H](C2)OC(=O)c1ccccc1
: