Target
Voltage-dependent L-type calcium channel subunit alpha-1C
Ligand
BDBM50231573
Substrate
Meas. Tech.
ChEMBL_92774 (CHEMBL700074)
Ki
14±n/a nM
Citation
 Baindur, NRutledge, ATriggle, DJ A homologous series of permanently charged 1,4-dihydropyridines: novel probes designed to localize drug binding sites on ion channels. J Med Chem 36:3743-5 (1994)  
Target
Name:
Voltage-dependent L-type calcium channel subunit alpha-1C
Synonyms:
CAC1C_RAT Cacn2 Cacnl1a1 Calcium channel (Type L) Calcium channel, L type, alpha-1 polypeptide, isoform 1, cardiac muscle RBC Voltage-dependent L-type calcium channel subunit alpha-1C Voltage-gated L-type calcium channel alpha-1C subunit | Voltage-gated calcium channel subunit alpha Cav1.2
Type:
Enzyme Catalytic Domain
Mol. Mass.:
243492.26
Organism:
RAT
Description:
Calcium channel 0 RAT::P22002
Residue:
2169
  
Inhibitor
Name:
BDBM50231573
Synonyms:
CHEMBL3350846
Type:
Small organic molecule
Emp. Form.:
C27H36F3NO4
Mol. Mass.:
495.5742
SMILES:
CCCCCCCCCCOC(=O)C1=C(C)NC(C)=C(C1c1ccccc1C(F)(F)F)C(=O)OC
: