Target
Neprilysin
Ligand
BDBM50042833
Substrate
Meas. Tech.
ChEBML_144597
IC50
551±n/a nM
Citation
 MacPherson, LJBayburt, EKCapparelli, MPBohacek, RSClarke, FHGhai, RDSakane, YBerry, CJPeppard, JVTrapani, AJ Design and synthesis of an orally active macrocyclic neutral endopeptidase 24.11 inhibitor. J Med Chem 36:3821-8 (1994)  
Target
Name:
Neprilysin
Synonyms:
Mme Neprilysin Neutral endopeptidase 24.11
Type:
Protein
Mol. Mass.:
85789.59
Organism:
Rattus norvegicus (Rat)
Description:
P07861
Residue:
750
  
Inhibitor
Name:
BDBM50042833
Synonyms:
9-Mercaptomethyl-10-oxo-azecane-2-carboxylic acid phenylamide | CHEMBL123955
Type:
Small organic molecule
Emp. Form.:
C17H24N2O2S
Mol. Mass.:
320.45
SMILES:
SCC1CCCCCCC(NC1=O)C(=O)Nc1ccccc1
: