Target
Neprilysin
Ligand
BDBM50042836
Substrate
Meas. Tech.
ChEBML_144597
IC50
84±n/a nM
Citation
 MacPherson, LJBayburt, EKCapparelli, MPBohacek, RSClarke, FHGhai, RDSakane, YBerry, CJPeppard, JVTrapani, AJ Design and synthesis of an orally active macrocyclic neutral endopeptidase 24.11 inhibitor. J Med Chem 36:3821-8 (1994)  
Target
Name:
Neprilysin
Synonyms:
Mme Neprilysin Neutral endopeptidase 24.11
Type:
Protein
Mol. Mass.:
85789.59
Organism:
Rattus norvegicus (Rat)
Description:
P07861
Residue:
750
  
Inhibitor
Name:
BDBM50042836
Synonyms:
9-Mercaptomethyl-10-oxo-azecane-2-carboxylic acid [2-(2-hydroxy-ethoxy)-ethyl]-amide | CHEMBL126640
Type:
Small organic molecule
Emp. Form.:
C15H28N2O4S
Mol. Mass.:
332.459
SMILES:
OCCOCCNC(=O)C1CCCCCCC(CS)C(=O)N1
: