Target
Beta-1/Beta-2/Beta-3 adrenergic receptor
Ligand
BDBM50019057
Substrate
Meas. Tech.
ChEMBL_41763 (CHEMBL650213)
EC50
>1500±n/a nM
Citation
 Chen, GTKing, MGusovsky, FCreveling, CRDaly, JWChen, BHNie, JYKirk, KL Syntheses of 2,5- and 2,6-difluoronorepinephrine, 2,5-difluoroepinephrine, and 2,6-difluorophenylephrine: effect of disubstitution with fluorine on adrenergic activity. J Med Chem 36:3947-55 (1994)  
Target
Name:
Beta-1/Beta-2/Beta-3 adrenergic receptor
Synonyms:
Adrenergic receptor beta
Type:
Mol. Mass.:
Description:
ASSAY_ID of ChEMBL is 1340543
Components:
This complex has 3 components.
Component 1
Name:
Beta-1 adrenergic receptor
Synonyms:
ADRB1R, B1AR Adrb1 Adrenergic receptor beta Beta-1 adrenoreceptor adrenergic Beta1,2
Type:
Protein
Mol. Mass.:
50486.84
Organism:
Rattus norvegicus (Rat)
Description:
P18090
Residue:
466
  
Component 2
Name:
Beta-2 adrenergic receptor
Synonyms:
ADRB2_RAT Adrb2r | Adrenergic receptor beta
Type:
PROTEIN
Mol. Mass.:
46896.26
Organism:
Rattus norvegicus
Description:
ChEMBL_38603
Residue:
418
  
Component 3
Name:
Beta-3 adrenergic receptor
Synonyms:
ADRB3_RAT Adrb3r Beta-3 adrenergic receptor
Type:
PROTEIN
Mol. Mass.:
43161.83
Organism:
Rattus norvegicus
Description:
ChEMBL_1509452
Residue:
400
  
Inhibitor
Name:
BDBM50019057
Synonyms:
(+/-)4-Fluoro-5-(1-hydroxy-2-methylamino-ethyl)-benzene-1,2-diol 4-Fluoro-5-(1-hydroxy-2-methylamino-ethyl)-benzene-1,2-diol(6-FEPI) | CHEMBL42359
Type:
Small organic molecule
Emp. Form.:
C9H12FNO3
Mol. Mass.:
201.1949
SMILES:
CNCC(O)c1cc(O)c(O)cc1F
: