Target
Beta-1 adrenergic receptor
Ligand
BDBM50042995
Substrate
Meas. Tech.
ChEBML_30207
Ki
81000±n/a nM
Citation
 Chen, GTKing, MGusovsky, FCreveling, CRDaly, JWChen, BHNie, JYKirk, KL Syntheses of 2,5- and 2,6-difluoronorepinephrine, 2,5-difluoroepinephrine, and 2,6-difluorophenylephrine: effect of disubstitution with fluorine on adrenergic activity. J Med Chem 36:3947-55 (1994)  
Target
Name:
Beta-1 adrenergic receptor
Synonyms:
ADRB1R, B1AR Adrb1 Adrenergic receptor beta Beta-1 adrenoreceptor adrenergic Beta1,2
Type:
Protein
Mol. Mass.:
50486.84
Organism:
Rattus norvegicus (Rat)
Description:
P18090
Residue:
466
  
Inhibitor
Name:
BDBM50042995
Synonyms:
2,4-Difluoro-3-(1-hydroxy-2-methylamino-ethyl)-phenol(2,6-DiFPE) | CHEMBL340189
Type:
Small organic molecule
Emp. Form.:
C9H11F2NO2
Mol. Mass.:
203.1859
SMILES:
CNCC(O)c1c(F)ccc(O)c1F
: