Target
Beta-1 adrenergic receptor
Ligand
BDBM50029051
Substrate
Meas. Tech.
ChEBML_30207
Ki
1600±n/a nM
Citation
 Chen, GTKing, MGusovsky, FCreveling, CRDaly, JWChen, BHNie, JYKirk, KL Syntheses of 2,5- and 2,6-difluoronorepinephrine, 2,5-difluoroepinephrine, and 2,6-difluorophenylephrine: effect of disubstitution with fluorine on adrenergic activity. J Med Chem 36:3947-55 (1994)  
Target
Name:
Beta-1 adrenergic receptor
Synonyms:
ADRB1R, B1AR Adrb1 Adrenergic receptor beta Beta-1 adrenoreceptor adrenergic Beta1,2
Type:
Protein
Mol. Mass.:
50486.84
Organism:
Rattus norvegicus (Rat)
Description:
P18090
Residue:
466
  
Inhibitor
Name:
BDBM50029051
Synonyms:
(-)-arterenol (-)-norepinephrine (R)-4-(2-amino-1-hydroxyethyl)-1,2-benzenediol (R)-norepinephrine CHEMBL1437 | NOREPINEPHRINE
Type:
Small organic molecule
Emp. Form.:
C8H11NO3
Mol. Mass.:
169.1778
SMILES:
NC[C@H](O)c1ccc(O)c(O)c1
: