Target
Acetylcholinesterase
Ligand
BDBM50368819
Substrate
Meas. Tech.
ChEMBL_29096 (CHEMBL636834)
IC50
95±n/a nM
Citation
 Sasho, SObase, HIchikawa, SKitazawa, TNonaka, HYoshizaki, RIshii, AShuto, K Synthesis of 2-imidazolidinylidenepropanedinitrile derivatives as stimulators of gastrointestinal motility. J Med Chem 36:572-9 (1993)  
Target
Name:
Acetylcholinesterase
Synonyms:
ACES_HUMAN Acetylcholinesterase (AChE) | Acetylcholinesterase (human AChE)
Type:
Enzyme
Mol. Mass.:
67792.70
Organism:
Homo sapiens (Human)
Description:
P22303
Residue:
614
  
Inhibitor
Name:
BDBM50368819
Synonyms:
CHEMBL1203534
Type:
Small organic molecule
Emp. Form.:
C19H24N6O
Mol. Mass.:
352.4335
SMILES:
N#CC(C#N)C1=NCCN1CCNCc1ccc(CN2CCC=CC2)o1
: