Target
Acetylcholinesterase
Ligand
BDBM48320
Substrate
Meas. Tech.
ChEMBL_29096 (CHEMBL636834)
IC50
>20000±n/a nM
Citation
 Sasho, SObase, HIchikawa, SKitazawa, TNonaka, HYoshizaki, RIshii, AShuto, K Synthesis of 2-imidazolidinylidenepropanedinitrile derivatives as stimulators of gastrointestinal motility. J Med Chem 36:572-9 (1993)  
Target
Name:
Acetylcholinesterase
Synonyms:
ACES_HUMAN Acetylcholinesterase (AChE) | Acetylcholinesterase (human AChE)
Type:
Enzyme
Mol. Mass.:
67792.70
Organism:
Homo sapiens (Human)
Description:
P22303
Residue:
614
  
Inhibitor
Name:
BDBM48320
Synonyms:
4-amino-5-chloro-N-[2-(diethylamino)ethyl]-2-methoxy-benzamide;hydrochloride 4-azanyl-5-chloranyl-N-[2-(diethylamino)ethyl]-2-methoxy-benzamide;hydrochloride METOCLOPRAMIDE HYDROCHLORIDE Metochloropramide US11147820, Compound Metoclopramide US9132134, Metoclopramide | cid_23659
Type:
Small organic molecule
Emp. Form.:
C14H22ClN3O2
Mol. Mass.:
299.796
SMILES:
CCN(CC)CCNC(=O)c1cc(Cl)c(N)cc1OC
: