Target
Acetylcholinesterase
Ligand
BDBM50047748
Substrate
Meas. Tech.
ChEMBL_29096 (CHEMBL636834)
IC50
4500±n/a nM
Citation
 Sasho, SObase, HIchikawa, SKitazawa, TNonaka, HYoshizaki, RIshii, AShuto, K Synthesis of 2-imidazolidinylidenepropanedinitrile derivatives as stimulators of gastrointestinal motility. J Med Chem 36:572-9 (1993)  
Target
Name:
Acetylcholinesterase
Synonyms:
ACES_HUMAN Acetylcholinesterase (AChE) | Acetylcholinesterase (human AChE)
Type:
Enzyme
Mol. Mass.:
67792.70
Organism:
Homo sapiens (Human)
Description:
P22303
Residue:
614
  
Inhibitor
Name:
BDBM50047748
Synonyms:
2-[1-(2-{[5-(2,6-Dimethyl-piperidin-1-ylmethyl)-furan-2-ylmethyl]-amino}-ethyl)-imidazolidin-2-ylidene]-malononitrile | CHEMBL153821
Type:
Small organic molecule
Emp. Form.:
C21H30N6O
Mol. Mass.:
382.5025
SMILES:
CC1CCCC(C)N1Cc1ccc(CNCCN2CCN=C2C(C#N)C#N)o1
: