Target
Muscarinic acetylcholine receptor M1
Ligand
BDBM50403547
Substrate
Meas. Tech.
ChEMBL_101212 (CHEMBL714427)
Ki
0.260000±n/a nM
Citation
 McPherson, DWDeHaven-Hudkins, DLCallahan, APKnapp, FF Synthesis and biodistribution of iodine-125-labeled 1-azabicyclo[2.2.2]oct-3-yl alpha-hydroxy-alpha-(1-iodo-1-propen-3-yl)-alpha-phenylacetate. A new ligand for the potential imaging of muscarinic receptors by single photon emission computed tomography. J Med Chem 36:848-54 (1993)  
Target
Name:
Muscarinic acetylcholine receptor M1
Synonyms:
ACM1_RAT Chrm-1 cholinergic receptor, muscarinic 1
Type:
Enzyme Catalytic Domain
Mol. Mass.:
51390.46
Organism:
RAT
Description:
P08482
Residue:
460
  
Inhibitor
Name:
BDBM50403547
Synonyms:
ATROPEN | ATROPINE
Type:
Small organic molecule
Emp. Form.:
C17H23NO3
Mol. Mass.:
289.3694
SMILES:
CN1[C@H]2CC[C@@H]1C[C@@H](C2)OC(=O)C(CO)c1ccccc1
: