Target
Sodium-dependent dopamine transporter
Ligand
BDBM50046737
Substrate
Meas. Tech.
ChEMBL_61352 (CHEMBL673254)
IC50
34±n/a nM
Citation
 Meltzer, PCLiang, AYBrownell, ALElmaleh, DRMadras, BK Substituted 3-phenyltropane analogs of cocaine: synthesis, inhibition of binding at cocaine recognition sites, and positron emission tomography imaging. J Med Chem 36:855-62 (1993)  
Target
Name:
Sodium-dependent dopamine transporter
Synonyms:
DA transporter DAT1 Dopamine transporter protein (DAT) SC6A3_HUMAN Sodium-dependent dopamine transporter Solute carrier family 6 member 3
Type:
Multi-pass membrane protein
Mol. Mass.:
68497.11
Organism:
Homo sapiens (Human)
Description:
Q01959
Residue:
620
  
Inhibitor
Name:
BDBM50046737
Synonyms:
3-(4-Fluoro-phenyl)-8-aza-bicyclo[3.2.1]octane-2-carboxylic acid methyl ester CHEMBL80515
Type:
Small organic molecule
Emp. Form.:
C15H18FNO2
Mol. Mass.:
263.3073
SMILES:
COC(=O)C1C2CCC(CC1c1ccc(F)cc1)N2
: