Target
D(2) dopamine receptor
Ligand
BDBM50034361
Substrate
Meas. Tech.
ChEMBL_62551 (CHEMBL674063)
Ki
>10000±n/a nM
Citation
 Lin, CHHaadsma-Svensson, SRPhillips, GLahti, RAMcCall, RBPiercey, MFSchreur, PJVon Voigtlander, PFSmith, MWChidester, CG Centrally acting serotonergic and dopaminergic agents. 2. Synthesis and structure-activity relationships of 2,3,3a,4,9,9a-hexahydro-1H-benz[f]indole derivatives. J Med Chem 36:1069-83 (1993)  
Target
Name:
D(2) dopamine receptor
Synonyms:
DOPAMINE D2 DOPAMINE D2 Short Dopamine D2 receptor Drd2
Type:
G Protein-Coupled Receptor (GPCR)
Mol. Mass.:
50931.60
Organism:
Rattus norvegicus (rat)
Description:
P61169
Residue:
444
  
Inhibitor
Name:
BDBM50034361
Synonyms:
(3aS,9aR)-1-Benzyl-5-methoxy-2,3,3a,4,9,9a-hexahydro-1H-benzo[f]indole CHEMBL11880
Type:
Small organic molecule
Emp. Form.:
C20H23NO
Mol. Mass.:
293.4027
SMILES:
COc1cccc2C[C@@H]3[C@H](CCN3Cc3ccccc3)Cc12
: