Target
5-hydroxytryptamine receptor 1A
Ligand
BDBM50034345
Substrate
Meas. Tech.
ChEMBL_579 (CHEMBL615449)
Ki
>1000±n/a nM
Citation
 Lin, CHHaadsma-Svensson, SRPhillips, GLahti, RAMcCall, RBPiercey, MFSchreur, PJVon Voigtlander, PFSmith, MWChidester, CG Centrally acting serotonergic and dopaminergic agents. 2. Synthesis and structure-activity relationships of 2,3,3a,4,9,9a-hexahydro-1H-benz[f]indole derivatives. J Med Chem 36:1069-83 (1993)  
Target
Name:
5-hydroxytryptamine receptor 1A
Synonyms:
5-HT-1A 5-hydroxytryptamine receptor 1A (5-HT-1A) ADRB2RL1 Dopamine D2 receptor and serotonin 1a receptor HTR1A | Serotonin receptor 1A
Type:
Mol. Mass.:
46122.49
Organism:
Homo sapiens (Human)
Description:
Residue:
422
  
Inhibitor
Name:
BDBM50034345
Synonyms:
(3aS,9aS)-1-Allyl-5-methoxy-2,3,3a,4,9,9a-hexahydro-1H-benzo[f]indole CHEMBL11294
Type:
Small organic molecule
Emp. Form.:
C16H21NO
Mol. Mass.:
243.344
SMILES:
COc1cccc2C[C@H]3[C@H](CCN3CC=C)Cc12
: