Target
5-hydroxytryptamine receptor 1B
Ligand
BDBM50043659
Substrate
Meas. Tech.
ChEMBL_1792 (CHEMBL616765)
Ki
888±n/a nM
Citation
 Meyer, MDDeBernardis, JFHancock, AA Synthesis and structure activity relationships of cis- and trans-2,3,4,4a,9,9a-hexahydro-1H-indeno[2,1-c]pyridines for 5-HT receptor subtypes. J Med Chem 37:105-12 (1994)  
Target
Name:
5-hydroxytryptamine receptor 1B
Synonyms:
5-HT-1B 5-hydroxytryptamine receptor 1B (5HT1B) 5ht1b Serotonin 1 (5-HT1) receptor Serotonin receptor 1B
Type:
Protein
Mol. Mass.:
43173.33
Organism:
Rattus norvegicus (Rat)
Description:
P28564
Residue:
386
  
Inhibitor
Name:
BDBM50043659
Synonyms:
4-Fluoro-N-[2-(5-methoxy-1,3,4,4a,9,9a-hexahydro-indeno[2,1-c]pyridin-2-yl)-ethyl]-benzamide | CHEMBL13904
Type:
Small organic molecule
Emp. Form.:
C22H25FN2O2
Mol. Mass.:
368.4445
SMILES:
COc1cccc2CC3CN(CCNC(=O)c4ccc(F)cc4)CCC3c12
: