Target
Adenosine deaminase
Ligand
BDBM50011575
Substrate
Meas. Tech.
ChEMBL_30798 (CHEMBL645074)
Ki
160±n/a nM
Citation
 Cristalli, GEleuteri, AVolpini, RVittori, SCamaioni, ELupidi, G Adenosine deaminase inhibitors: synthesis and structure-activity relationships of 2-hydroxy-3-nonyl derivatives of azoles. J Med Chem 37:201-5 (1994)  
Target
Name:
Adenosine deaminase
Synonyms:
ADA Adenosine aminohydrolase
Type:
Enzyme
Mol. Mass.:
40910.44
Organism:
Bos taurus (bovine)
Description:
Residue:
363
  
Inhibitor
Name:
BDBM50011575
Synonyms:
3-(4-Amino-imidazo[4,5-c]pyridin-1-yl)-nonan-2-ol | CHEMBL18496
Type:
Small organic molecule
Emp. Form.:
C15H24N4O
Mol. Mass.:
276.3773
SMILES:
CCCCCCC(C(C)O)n1cnc2c(N)nccc12
: