Target
Kappa-type opioid receptor
Ligand
BDBM50041573
Substrate
Meas. Tech.
ChEMBL_146798 (CHEMBL756053)
Ki
0.040000±n/a nM
Citation
 Portoghese, PSLin, CEFarouz-Grant, FTakemori, AE Structure-activity relationship of N17'-substituted norbinaltorphimine congeners. Role of the N17' basic group in the interaction with a putative address subsite on the kappa opioid receptor. J Med Chem 37:1495-500 (1994)  
Target
Name:
Kappa-type opioid receptor
Synonyms:
Kappa Opioid Receptor OPRK1 Opiate Kappa 1 | mu/kappa opioid receptor
Type:
G Protein-Coupled Receptor (GPCR)
Mol. Mass.:
42744.99
Organism:
Cavia porcellus (domestic guinea pig)
Description:
P41144
Residue:
380
  
Inhibitor
Name:
BDBM50041573
Synonyms:
17-(cyclopropylmethyl)-17'-butyl-6,6',7,7'-tetradehydro-4,5:4',5'-diepoxy-6,6'-imino-7,7'-bimorphinan-3,3',14,14'-tetrol | CHEMBL285410
Type:
Small organic molecule
Emp. Form.:
C40H45N3O6
Mol. Mass.:
663.8018
SMILES:
CCCCN1CC[C@@]23[C@H]4Oc5c2c(C[C@@H]1[C@]3(O)Cc1c2C[C@@]3(O)[C@H]6Cc7ccc(O)c8O[C@@H](c2[nH]c41)[C@]3(CCN6CC1CC1)c78)ccc5O
: