Target
Delta-type opioid receptor
Ligand
BDBM50041668
Substrate
Meas. Tech.
ChEMBL_146764 (CHEMBL755208)
IC50
30000±n/a nM
Citation
 Haaseth, RCHoran, PJBilsky, EJDavis, PZalewska, TSlaninova, JYamamura, HIWeber, SJDavis, TPPorreca, F [L-Ala3]DPDPE: a new enkephalin analog with a unique opioid receptor activity profile. Further evidence of delta-opioid receptor multiplicity. J Med Chem 37:1572-7 (1994)  
Target
Name:
Delta-type opioid receptor
Synonyms:
Cytochrome P450 3A4 Delta opioid receptor Delta-type opioid receptor (DOR) OPRD_RAT Opioid receptor Opioid receptors; mu & delta Ror-a | Voltage-gated potassium channel
Type:
G Protein-Coupled Receptor (GPCR)
Mol. Mass.:
40465.04
Organism:
Rattus norvegicus (rat)
Description:
Competition binding assays were using CHO-K1 cell membranes expressing the opioid receptor.
Residue:
372
  
Inhibitor
Name:
BDBM50041668
Synonyms:
2-Amino-N-((S)-7-benzyl-4-dihydroxymethyl-10-ethyl-3,3,14,14-tetramethyl-6,9,12-trioxo-1,2-dithia-5,8,11-triaza-cyclotetradec-13-yl)-3-(4-hydroxy-phenyl)-propionamide | CHEMBL2372411
Type:
Small organic molecule
Emp. Form.:
C32H45N5O7S2
Mol. Mass.:
675.859
SMILES:
CC[C@H]1NC(=O)[C@@H](NC(=O)[C@@H](N)Cc2ccc(O)cc2)C(C)(C)SSC(C)(C)[C@H](NC(=O)[C@H](Cc2ccccc2)NC1=O)C(O)O
: