Target
Neuromedin-K receptor
Ligand
BDBM50030161
Substrate
Meas. Tech.
ChEMBL_143201 (CHEMBL747339)
IC50
>10000±n/a nM
Citation
 Josien, HLavielle, SBrunissen, ASaffroy, MTorrens, YBeaujouan, JCGlowinski, JChassaing, G Design and synthesis of side-chain conformationally restricted phenylalanines and their use for structure-activity studies on tachykinin NK-1 receptor. J Med Chem 37:1586-601 (1994)  
Target
Name:
Neuromedin-K receptor
Synonyms:
NK3R_RAT Tac3r | Tacr3
Type:
Mol. Mass.:
51128.60
Organism:
Rattus norvegicus
Description:
ChEMBL_10983
Residue:
452
  
Inhibitor
Name:
BDBM50030161
Synonyms:
Arg-Pro-Lys-Pro-Gln-Gln-Phe-Phe-Pro-Leu-Met | CHEMBL2372518
Type:
Small organic molecule
Emp. Form.:
C66H102N18O13S
Mol. Mass.:
1387.694
SMILES:
[#6]-[#16]-[#6]-[#6]-[#6@@H](-[#7]-[#6](=O)-[#6@H](-[#6]-[#6](-[#6])-[#6])-[#7]-[#6](=O)-[#6@@H]-1-[#6]-[#6]-[#6]-[#7]-1-[#6](=O)-[#6@H](-[#6]-c1ccccc1)-[#7]-[#6](=O)-[#6@H](-[#6]-c1ccccc1)-[#7]-[#6](=O)-[#6@H](-[#6]-[#6]-[#6](-[#7])=O)-[#7]-[#6](=O)-[#6@H](-[#6]-[#6]-[#6](-[#7])=O)-[#7]-[#6](=O)-[#6@@H]-1-[#6]-[#6]-[#6]-[#7]-1-[#6](=O)-[#6@H](-[#6]-[#6]-[#6]-[#6]-[#7])-[#7]-[#6](=O)-[#6@@H]-1-[#6]-[#6]-[#6]-[#7]-1-[#6](=O)-[#6@@H](-[#7])-[#6]-[#6]-[#6]\[#7]=[#6](\[#7])-[#7])-[#6](-[#7])=O
: