Target
Substance-P receptor
Ligand
BDBM50030157
Substrate
Meas. Tech.
ChEMBL_143043 (CHEMBL750292)
IC50
62±n/a nM
Citation
 Josien, HLavielle, SBrunissen, ASaffroy, MTorrens, YBeaujouan, JCGlowinski, JChassaing, G Design and synthesis of side-chain conformationally restricted phenylalanines and their use for structure-activity studies on tachykinin NK-1 receptor. J Med Chem 37:1586-601 (1994)  
Target
Name:
Substance-P receptor
Synonyms:
NK-1 receptor NK1 Receptor Neurokinin 1 receptor SPR Tac1r Tacr1
Type:
G Protein-Coupled Receptor (GPCR)
Mol. Mass.:
46371.54
Organism:
Rattus norvegicus (rat)
Description:
Competition binding assays were carried out using membrane preparations from transfected CHO cells that constitutively expressed the rat NK1 receptor.
Residue:
407
  
Inhibitor
Name:
BDBM50030157
Synonyms:
Arg-Pro-Lys-Pro-Gln-Gln-Phe-Hph-Gly-Leu-Met | CHEMBL411230
Type:
Small organic molecule
Emp. Form.:
C64H100N18O13S
Mol. Mass.:
1361.657
SMILES:
CSCC[C@H](NC(=O)[C@H](CC(C)C)NC(=O)CNC(=O)[C@H](CCc1ccccc1)NC(=O)[C@H](Cc1ccccc1)NC(=O)[C@H](CCC(N)=O)NC(=O)[C@H](CCC(N)=O)NC(=O)[C@H]1CCCN1C(=O)[C@H](CCCCN)NC(=O)[C@@H]1CCCN1C(=O)[C@@H](N)CCCNC(N)=N)C(N)=O
: