Target
Substance-K receptor
Ligand
BDBM50030146
Substrate
Meas. Tech.
ChEMBL_143188 (CHEMBL749850)
IC50
9±n/a nM
Citation
 Josien, HLavielle, SBrunissen, ASaffroy, MTorrens, YBeaujouan, JCGlowinski, JChassaing, G Design and synthesis of side-chain conformationally restricted phenylalanines and their use for structure-activity studies on tachykinin NK-1 receptor. J Med Chem 37:1586-601 (1994)  
Target
Name:
Substance-K receptor
Synonyms:
NK-2 receptor NK2R_RAT Neurokinin A receptor SKR Tac2r Tacr2
Type:
Enzyme Catalytic Domain
Mol. Mass.:
43868.63
Organism:
Rattus norvegicus (Rat)
Description:
Neurokinin NK2 TACR2 Murine::P16610
Residue:
390
  
Inhibitor
Name:
BDBM50030146
Synonyms:
Arg-Pro-Lys-Pro-Gln-Gln-Phe-Tle-Gly-Leu-Met | CHEMBL263852
Type:
Small organic molecule
Emp. Form.:
C60H100N18O13S
Mol. Mass.:
1313.614
SMILES:
CSCC[C@H](NC(=O)[C@H](CC(C)C)NC(=O)CNC(=O)[C@@H](NC(=O)[C@H](Cc1ccccc1)NC(=O)[C@H](CCC(N)=O)NC(=O)[C@H](CCC(N)=O)NC(=O)[C@H]1CCCN1C(=O)[C@H](CCCCN)NC(=O)[C@@H]1CCCN1C(=O)[C@@H](N)CCCNC(N)=N)C(C)(C)C)C(N)=O
: