Target
Substance-P receptor
Ligand
BDBM50030150
Substrate
Meas. Tech.
ChEMBL_143043 (CHEMBL750292)
IC50
2500±n/a nM
Citation
 Josien, HLavielle, SBrunissen, ASaffroy, MTorrens, YBeaujouan, JCGlowinski, JChassaing, G Design and synthesis of side-chain conformationally restricted phenylalanines and their use for structure-activity studies on tachykinin NK-1 receptor. J Med Chem 37:1586-601 (1994)  
Target
Name:
Substance-P receptor
Synonyms:
NK-1 receptor NK1 Receptor Neurokinin 1 receptor SPR Tac1r Tacr1
Type:
G Protein-Coupled Receptor (GPCR)
Mol. Mass.:
46371.54
Organism:
Rattus norvegicus (rat)
Description:
Competition binding assays were carried out using membrane preparations from transfected CHO cells that constitutively expressed the rat NK1 receptor.
Residue:
407
  
Inhibitor
Name:
BDBM50030150
Synonyms:
Arg-Pro-Lys-Pro-Gln-Gln-Phe-Dip-Pro-Leu-Met | CHEMBL2372517
Type:
Small organic molecule
Emp. Form.:
C72H106N18O13S
Mol. Mass.:
1463.79
SMILES:
[#6]-[#16]-[#6]-[#6]-[#6@@H](-[#7]-[#6](=O)-[#6@H](-[#6]-[#6](-[#6])-[#6])-[#7]-[#6](=O)-[#6@@H]-1-[#6]-[#6]-[#6]-[#7]-1-[#6](=O)-[#6@@H](-[#7]-[#6](=O)-[#6@H](-[#6]-c1ccccc1)-[#7]-[#6](=O)-[#6@H](-[#6]-[#6]-[#6](-[#7])=O)-[#7]-[#6](=O)-[#6@H](-[#6]-[#6]-[#6](-[#7])=O)-[#7]-[#6](=O)-[#6@@H]-1-[#6]-[#6]-[#6]-[#7]-1-[#6](=O)-[#6@H](-[#6]-[#6]-[#6]-[#6]-[#7])-[#7]-[#6](=O)-[#6@@H]-1-[#6]-[#6]-[#6]-[#7]-1-[#6](=O)-[#6@@H](-[#7])-[#6]-[#6]-[#6]\[#7]=[#6](\[#7])-[#7])-[#6](-c1ccccc1)-c1ccccc1)-[#6](-[#7])=O
: