Target
Muscarinic acetylcholine receptor M1
Ligand
BDBM50038707
Substrate
Meas. Tech.
ChEMBL_139960 (CHEMBL749015)
Ki
880±n/a nM
Citation
 Hudkins, RLMailman, RBDeHaven-Hudkins, DL Novel (4-phenylpiperidinyl)- and (4-phenylpiperazinyl)alkyl-spaced esters of 1-phenylcyclopentanecarboxylic acids as potent sigma-selective compounds. J Med Chem 37:1964-70 (1994)  
Target
Name:
Muscarinic acetylcholine receptor M1
Synonyms:
ACM1_RAT Chrm-1 cholinergic receptor, muscarinic 1
Type:
Enzyme Catalytic Domain
Mol. Mass.:
51390.46
Organism:
RAT
Description:
P08482
Residue:
460
  
Inhibitor
Name:
BDBM50038707
Synonyms:
1-(4-Nitro-phenyl)-cyclopentanecarboxylic acid 2-(4-phenyl-piperidin-1-yl)-ethyl ester; hydrochloride | CHEMBL541284
Type:
Small organic molecule
Emp. Form.:
C25H30N2O4
Mol. Mass.:
422.5167
SMILES:
[O-][N+](=O)c1ccc(cc1)C1(CCCC1)C(=O)OCCN1CCC(CC1)c1ccccc1
: