Target
Sigma non-opioid intracellular receptor 1
Ligand
BDBM50038717
Substrate
Meas. Tech.
ChEMBL_200981 (CHEMBL801234)
Ki
0.27±n/a nM
Citation
 Hudkins, RLMailman, RBDeHaven-Hudkins, DL Novel (4-phenylpiperidinyl)- and (4-phenylpiperazinyl)alkyl-spaced esters of 1-phenylcyclopentanecarboxylic acids as potent sigma-selective compounds. J Med Chem 37:1964-70 (1994)  
Target
Name:
Sigma non-opioid intracellular receptor 1
Synonyms:
Aging-associated gene 8 protein SGMR1_HUMAN SIGMAR1 SR31747-binding protein Sigma 1-type opioid receptor Sigma1R | hSigmaR1
Type:
Enzyme Catalytic Domain
Mol. Mass.:
25124.85
Organism:
Homo sapiens (Human)
Description:
Q99720
Residue:
223
  
Inhibitor
Name:
BDBM50038717
Synonyms:
1-(4-Nitro-phenyl)-cyclopentanecarboxylic acid 3-(4-phenyl-piperidin-1-yl)-propyl ester; hydrochloride | CHEMBL542131
Type:
Small organic molecule
Emp. Form.:
C26H32N2O4
Mol. Mass.:
436.5433
SMILES:
[O-][N+](=O)c1ccc(cc1)C1(CCCC1)C(=O)OCCCN1CCC(CC1)c1ccccc1
: