Target
Sodium-dependent dopamine transporter
Ligand
BDBM50038743
Substrate
Meas. Tech.
ChEMBL_61353 (CHEMBL673255)
IC50
8900±n/a nM
Citation
 Meltzer, PCLiang, AYMadras, BK The discovery of an unusually selective and novel cocaine analog: difluoropine. Synthesis and inhibition of binding at cocaine recognition sites. J Med Chem 37:2001-10 (1994)  
Target
Name:
Sodium-dependent dopamine transporter
Synonyms:
DA transporter DAT1 Dopamine transporter protein (DAT) SC6A3_HUMAN Sodium-dependent dopamine transporter Solute carrier family 6 member 3
Type:
Multi-pass membrane protein
Mol. Mass.:
68497.11
Organism:
Homo sapiens (Human)
Description:
Q01959
Residue:
620
  
Inhibitor
Name:
BDBM50038743
Synonyms:
(3S,8R)-3-[Bis-(4-fluoro-phenyl)-methoxy]-8-methyl-8-aza-bicyclo[3.2.1]octane-2-carboxylic acid methyl ester CHEMBL294007 | ChEMBL_96467
Type:
Small organic molecule
Emp. Form.:
C23H25F2NO3
Mol. Mass.:
401.4463
SMILES:
COC(=O)C1C2CCC(C[C@@H]1OC(c1ccc(F)cc1)c1ccc(F)cc1)N2C
: