Target
Sodium-dependent serotonin transporter
Ligand
BDBM50366775
Substrate
Meas. Tech.
ChEMBL_201223 (CHEMBL801199)
IC50
24100±n/a nM
Citation
 Meltzer, PCLiang, AYMadras, BK The discovery of an unusually selective and novel cocaine analog: difluoropine. Synthesis and inhibition of binding at cocaine recognition sites. J Med Chem 37:2001-10 (1994)  
Target
Name:
Sodium-dependent serotonin transporter
Synonyms:
5-HT Transporter 5HTT SC6A4_HUMAN SLC6A4 Serotonin transporter (5HTT) Sodium-dependent serotonin transporter (SERT) | Solute carrier family 6 member 4
Type:
Multi-pass membrane protein
Mol. Mass.:
70322.51
Organism:
Homo sapiens (Human)
Description:
P31645
Residue:
630
  
Inhibitor
Name:
BDBM50366775
Synonyms:
BENZTROPINE | Benzatropine
Type:
Small organic molecule
Emp. Form.:
C21H25NO
Mol. Mass.:
307.4293
SMILES:
CN1[C@H]2CC[C@@H]1C[C@@H](C2)OC(c1ccccc1)c1ccccc1
: