Target
3-oxo-5-alpha-steroid 4-dehydrogenase 2
Ligand
BDBM50039273
Substrate
Meas. Tech.
ChEMBL_202883 (CHEMBL810001)
IC50
0.40±n/a nM
Citation
 Frye, SVHaffner, CDMaloney, PRMook, RADorsey, GFHiner, RNCribbs, CMWheeler, TNRay, JAAndrews, RC 6-Azasteroids: structure-activity relationships for inhibition of type 1 and 2 human 5 alpha-reductase and human adrenal 3 beta-hydroxy-delta 5-steroid dehydrogenase/3-keto-delta 5-steroid isomerase. J Med Chem 37:2352-60 (1994)  
Target
Name:
3-oxo-5-alpha-steroid 4-dehydrogenase 2
Synonyms:
3-oxo-5-alpha-steroid 4-dehydrogenase 2 5α-Reductase 2 (5α-R2) SR type 2 Steroid 5-alpha-reductase Type II 5-alpha reductase
Type:
Enzyme
Mol. Mass.:
28406.59
Organism:
Homo sapiens (Human)
Description:
P31213
Residue:
254
  
Inhibitor
Name:
BDBM50039273
Synonyms:
(1S,9aR,11aS)-6-Bromo-9a,11a-dimethyl-1-(3-methyl-butyryl)-1,2,3,3a,3b,4,5,8,9,9a,9b,10,11,11a-tetradecahydro-cyclopenta[i]phenanthridin-7-one | CHEMBL311045
Type:
Small organic molecule
Emp. Form.:
C23H34BrNO2
Mol. Mass.:
436.426
SMILES:
CC(C)CC(=O)[C@H]1CCC2C3CN=C4C(Br)C(=O)CC[C@]4(C)C3CC[C@]12C
: