Target
Neutrophil elastase
Ligand
BDBM50039642
Substrate
Meas. Tech.
ChEMBL_63980 (CHEMBL677606)
Ki
0.17±n/a nM
Citation
 Subramanyam, CBell, MRCarabateas, PCourt, JJDority, JAFerguson, EGordon, RHlasta, DJKumar, VSaindane, M 2,6-Disubstituted aryl carboxylic acids, leaving groups"par excellence" for benzisothiazolone inhibitors of human leukocyte elastase. J Med Chem 37:2623-6 (1994)  
Target
Name:
Neutrophil elastase
Synonyms:
Bone marrow serine protease Coagulation factor X ELANE Elastase HLE Leukocyte elastase Medullasin Neutrophil elastase (HNE) PMN elastase Trypsin
Type:
Enzyme
Mol. Mass.:
28532.38
Organism:
Homo sapiens (Human)
Description:
P08246
Residue:
267
  
Inhibitor
Name:
BDBM50039642
Synonyms:
2,6-Dichloro-benzoic acid 4-ethyl-1,1,3-trioxo-1,3-dihydro-1lambda*6*-benzo[d]isothiazol-2-ylmethyl ester | CHEMBL432049
Type:
Small organic molecule
Emp. Form.:
C17H13Cl2NO5S
Mol. Mass.:
414.26
SMILES:
CCc1cccc2c1C(=O)N(COC(=O)c1c(Cl)cccc1Cl)S2(=O)=O
: