Target
5-hydroxytryptamine receptor 1A
Ligand
BDBM50453387
Substrate
Meas. Tech.
ChEMBL_1437 (CHEMBL616310)
Ki
>333±n/a nM
Citation
 Sonesson, CLin, CHHansson, LWaters, NSvensson, KCarlsson, ASmith, MWWikström, H Substituted (S)-phenylpiperidines and rigid congeners as preferential dopamine autoreceptor antagonists: synthesis and structure-activity relationships. J Med Chem 37:2735-53 (1994)  
Target
Name:
5-hydroxytryptamine receptor 1A
Synonyms:
5-HT-1A 5-HT1A 5-hydroxytryptamine receptor 1A (5HT1A) 5ht1a Htr1a Serotonin 1a (5-HT1a) receptor/Adrenergic receptor alpha-1 | Serotonin receptor 1A
Type:
G Protein-Coupled Receptor (GPCR)
Mol. Mass.:
46445.29
Organism:
Rattus norvegicus (rat)
Description:
Binding assays were performed using rat hippocampal membranes.
Residue:
422
  
Inhibitor
Name:
BDBM50453387
Synonyms:
CHEMBL566970
Type:
Small organic molecule
Emp. Form.:
C16H21NO
Mol. Mass.:
243.344
SMILES:
[H][C@]12CCc3c(OC)cccc3[C@@]1([H])CCN2CC=C
: