Target
Sodium-dependent dopamine transporter
Ligand
BDBM50039987
Substrate
Meas. Tech.
ChEMBL_62180 (CHEMBL672119)
IC50
26±n/a nM
Citation
 Carroll, FIMascarella, SWKuzemko, MAGao, YAbraham, PLewin, AHBoja, JWKuhar, MJ Synthesis, ligand binding, and QSAR (CoMFA and classical) study of 3 beta-(3'-substituted phenyl)-, 3 beta-(4'-substituted phenyl)-, and 3 beta-(3',4'-disubstituted phenyl)tropane-2 beta-carboxylic acid methyl esters. J Med Chem 37:2865-73 (1994)  
Target
Name:
Sodium-dependent dopamine transporter
Synonyms:
DA transporter SC6A3_RAT Sodium-dependent dopamine transporter | Sodium-dependent dopamine transporter (DAT)
Type:
Multi-pass membrane protein
Mol. Mass.:
68749.45
Organism:
Rattus norvegicus (rat)
Description:
P23977
Residue:
619
  
Inhibitor
Name:
BDBM50039987
Synonyms:
(3S,8R)-3-(3-Iodo-phenyl)-8-methyl-8-aza-bicyclo[3.2.1]octane-2-carboxylic acid methyl ester
Type:
Small organic molecule
Emp. Form.:
C16H20INO2
Mol. Mass.:
385.24
SMILES:
COC(=O)C1C2CCC(C[C@@H]1c1cccc(I)c1)N2C
: