Target
Sodium channel protein type 2 subunit alpha
Ligand
BDBM50043997
Substrate
Meas. Tech.
ChEMBL_144081 (CHEMBL753044)
IC50
13000±n/a nM
Citation
 Roufos, IHays, SJDooley, DJSchwarz, RDCampbell, GWProbert, AW Synthesis and pharmacological evaluation of phenylacetamides as sodium-channel blockers. J Med Chem 37:268-74 (1994)  
Target
Name:
Sodium channel protein type 2 subunit alpha
Synonyms:
SCN2A_RAT Scn2a1 Sodium channel protein type 2 subunit alpha Sodium channel protein type II subunit alpha Voltage-gated sodium channel | Voltage-gated sodium channel subunit alpha Nav1.2
Type:
PROTEIN
Mol. Mass.:
227854.11
Organism:
Rattus norvegicus
Description:
ChEMBL_1516893
Residue:
2005
  
Inhibitor
Name:
BDBM50043997
Synonyms:
9H-Xanthene-9-carboxylic acid [3-(2,6-dimethyl-piperidin-1-yl)-propyl]-amide | CHEMBL93634
Type:
Small organic molecule
Emp. Form.:
C24H30N2O2
Mol. Mass.:
378.5072
SMILES:
CC1CCCC(C)N1CCCNC(=O)C1c2ccccc2Oc2ccccc12
: