Target
Thymidylate synthase
Ligand
BDBM50037315
Substrate
Meas. Tech.
ChEMBL_209959 (CHEMBL820615)
IC50
17±n/a nM
Citation
 Bisset, GMBavetsias, VThornton, TJPawelczak, KCalvert, AHHughes, LRJackman, AL The synthesis and thymidylate synthase inhibitory activity of L-gamma-L-linked dipeptide and L-gamma-amide analogues of 2-desamino-2-methyl-N10-propargyl-5,8-dideazafolic acid (ICI 198583). J Med Chem 37:3294-302 (1994)  
Target
Name:
Thymidylate synthase
Synonyms:
TS TYSY_MOUSE | Tyms
Type:
PROTEIN
Mol. Mass.:
34957.15
Organism:
Mus musculus
Description:
ChEMBL_1340097
Residue:
307
  
Inhibitor
Name:
BDBM50037315
Synonyms:
(R)-4-((R)-1-Carboxy-propylcarbamoyl)-2-{4-[(2-methyl-4-oxo-3,4-dihydro-quinazolin-6-ylmethyl)-prop-2-ynyl-amino]-benzoylamino}-butyric acid | CHEMBL263535
Type:
Small organic molecule
Emp. Form.:
C29H31N5O7
Mol. Mass.:
561.5857
SMILES:
CC[C@@H](NC(=O)CC[C@@H](NC(=O)c1ccc(cc1)N(CC#C)Cc1ccc2nc(C)[nH]c(=O)c2c1)C(O)=O)C(O)=O
: